{"text_format":"1","workbook":"xlsx","n_sheets":3,"sheets":["Original","Tabelle1","Auswahlhilfe"],"not_rendered":{"charts":0,"images":2,"macros":1,"external_links":0,"defined_names":1,"comments":2,"pivot_tables":0},"unopened":[],"bounds":{"document_bytes":16777216,"sheet_cells":100000,"rows_first":2000,"rows_last":500,"rows_between":2000,"halvings":0,"cell_chars":16384,"cell_head_chars":4096},"cells_cut":0,"cells_raw":0,"read":"whole","date_system":"1900"}

{"sheet":"Original","index":0,"n_rows":492,"n_cols":431,"rows_kept":492,"cut":false,"hidden":true,"merged":[]}
["Artikel-Nr.","Artikel Beschreibung 1","Artikel Beschreibung 2","Einheit","VPE","In VPE  entahltene Stückzahl","VPE PAL","Listen Preis EUR","Rabatt Gruppe","MF1110","MF1120","MF1126","MF1160","MF1170","MF1210","MF12130","MF12150","MF1220","MF12230","MF1226","MF12309","MF1260","MF12674","MF12695","MF1270","MF1310","MF13150","MF1320","MF13250","MF1326","MF13312","MF13322","MF1360","MF13674","MF13695","MF1370","MF1410","MF1420","MF1426","MF1460","MF14695","MF1470","MF1510","MF1520","MF1526","MF1560","MF1570","MF15903","MF15950","MF15951","MF2110","MF2120","MF2126","MF2160","MF2170","MF2210","MF22131","MF22151","MF2220","MF22231","MF22251","MF2226","MF22309","MF2260","MF22674","MF2270","MF2310","MF23160","MF2320","MF2326","MF23260","MF23322","MF2360","MF23674","MF2370","MF2410","MF24160","MF2420","MF2426","MF24260","MF2460","MF2470","MF2510","MF2520","MF2526","MF2560","MF2570","MF25903","MT1110","MT1120","MT1126","MT1160","MT1169","MT1170","MT1210","MT12130","MT12150","MT1220","MT12230","MT1226","MT12309","MT12509","MT1260","MT12674","MT1267A","MT1269","MT12695","MT1270","MT12709","MT12774","MT1281","MT1310","MT13150","MT1320","MT13250","MT1326","MT13312","MT13322","MT13512","MT1360","MT13674","MT1369","MT13695","MT1370","MT13703","MT13709","MT13722","MT13774M","MT1380","MT1381","MT1410","MT1420","MT1426","MT1460","MT1469","MT14695","MT1470","MT1510","MT1520","MT1526","MT1560","MT1569","MT1570","MT1581","MT15903","MT15950","MT15951","MT2110","MT2120","MT2126","MT2160","MT2169","MT2170","MT2210","MT22131","MT22151","MT2220","MT22231","MT22251","MT2226","MT22309","MT22509","MT2260","MT22674","MT2269","MT2270","MT22709","MT22774","MT2310","MT23160","MT2320","MT2326","MT23260","MT23322","MT23512","MT23519","MT2360","MT23674","MT2369","MT2370","MT23703","MT23709","MT23722","MT23774M","MT2410","MT24160","MT2420","MT2426","MT24260","MT2460","MT2469","MT2470","MT2510","MT2520","MT2526","MT2560","MT2569","MT2570","MT25903","MFS22603","MFS23605","MFS25903","MFS28905","MFS42603","MFS43605","MFS45903","MFS48905","MFS52603","MFS53605","MFS55903","MFS58905","MFSC12613","MFSC12633","MFSC12643","MFSC13615","MFSC13625","MFSC13635","MFSC13645","MFSC15963","MFSC15983","MFSC17965","MFSC18985","MFSC22613","MFSC22633","MFSC22643","MFSC23615","MFSC23635","MFSC23645","MFSC25963","MFSC25983","MFSC27965","MFSC28985","MFSC32613","MFSC32633","MFSC32643","MFSC33615","MFSC33635","MFSC33645","MFSC35963","MFSC35983","MFSC37965","MFSC38985","MFSC42613","MFSC42633","MFSC42643","MFSC43615","MFSC43635","MFSC43645","MFSC45963","MFSC45983","MFSC47965","MFSC48985","MFSC52613","MFSC52633","MFSC52643","MFSC53615","MFSC53635","MFSC53645","MFSC55963","MFSC55983","MFSC57965","MFSC58985","MTS12505","MTS22505","MTS22603","MTS22703","MTS23605","MTS23705","MTS25903","MTS28905","MTS32505","MTS42505","MTS42603","MTS42703","MTS43605","MTS43705","MTS45903","MTS48905","MTS52505","MTS52603","MTS52703","MTS53605","MTS53705","MTS55903","MTS58905","MTSC12515","MTSC12535","MTSC12613","MTSC12633","MTSC12643","MTSC12733","MTSC12743","MTSC12763","MTSC13615","MTSC13635","MTSC13645","MTSC13735","MTSC13745","MTSC13765","MTSC15963","MTSC15983","MTSC17965","MTSC18985","MTSC22515","MTSC22535","MTSC22613","MTSC22633","MTSC22643","MTSC22653","MTSC22733","MTSC22743","MTSC22763","MTSC23615","MTSC23635","MTSC23645","MTSC23735","MTSC23745","MTSC23765","MTSC25963","MTSC25983","MTSC27965","MTSC28985","MTSC32515","MTSC32535","MTSC32613","MTSC32633","MTSC32643","MTSC32733","MTSC32743","MTSC32763","MTSC33615","MTSC33635","MTSC33645","MTSC33735","MTSC33745","MTSC33765","MTSC35963","MTSC35983","MTSC35993","MTSC37965","MTSC38985","MTSC42515","MTSC42535","MTSC42613","MTSC42633","MTSC42643","MTSC42733","MTSC42743","MTSC42753","MTSC42763","MTSC43615","MTSC43635","MTSC43645","MTSC43735","MTSC43745","MTSC43765","MTSC45963","MTSC45973","MTSC45983","MTSC47965","MTSC48985","MTSC52515","MTSC52535","MTSC52613","MTSC52633","MTSC52643","MTSC52733","MTSC52743","MTSC52763","MTSC53615","MTSC53635","MTSC53645","MTSC53735","MTSC53745","MTSC53765","MTSC55963","MTSC55983","MTSC57965","MTSC58985","MXS21201","MXS21301","MXS21401","MXS41301","MXS41401","MXS51301","MXS51401","MXSC11211","MXSC11231","MXSC11311","MXSC11331","MXSC11341","MXSC11361","MXSC11411","MXSC11431","MXSC11441","MXSC11461","MXSC21211","MXSC21231","MXSC21311","MXSC21331","MXSC21341","MXSC21361","MXSC21411","MXSC21431","MXSC21441","MXSC21461","MXSC31311","MXSC31331","MXSC31341","MXSC31351","MXSC31361","MXSC31411","MXSC31431","MXSC31441","MXSC31461","MXSC41311","MXSC41331","MXSC41341","MXSC41361","MXSC41411","MXSC41431","MXSC41441","MXSC41461","MXSC51311","MXSC51331","MXSC51341","MXSC51361","MXSC51411","MXSC51431","MXSC51441","MXSC51461"]
["FAG11N","Abdeckplatte 250x150mm 1FB/1RE","geschlossen","ST",1,1,0,23.8,"335",1,null,1,1,1,null,null,null,null,null,null,null,null,null,null,null,null,null,null,null,null,null,null,null,null,null,null,null,null,null,null,null,null,null,null,null,null,null,null,null,null,null,null,null,null,null,null,null,null,null,null,null,null,null,null,null,null,null,null,null,null,null,null,null,null,null,null,null,null,null,null,null,null,null,null,null,null,null,null,1,null,1,1,null,1]
["FAG11N10","Abdeckplatte 250x150mm 1FB/1RE","geschlossen (10 Stück)","ST",1,10,0,158.5,"335"]
["FAG12N","Abdeckplatte 250x300mm 1FB/2RE","geschlossen","ST",1,1,0,30.3,"335",null,null,null,null,null,1,null,null,null,null,1,null,1,null,null,1,null,null,null,null,null,null,null,null,null,null,null,null,null,null,null,null,null,null,null,null,null,null,null,null,null,null,null,null,null,null,null,null,null,null,null,null,null,null,null,null,null,null,null,null,null,null,null,null,null,null,null,null,null,null,null,null,null,null,null,null,null,null,null,null,null,null,null,null,null,1,null,null,null,null,1,null,null,1,null,null,1,null,1]
["FAG12N10","Abdeckplatte 250x300mm 1FB/2RE","geschlossen (10 Stück)","ST",1,10,0,201.5,"335"]
["FAG13N","Abdeckplatte 250x450mm 1FB/3RE","geschlossen","ST",1,1,0,34.299999999999997,"335",null,null,null,null,null,null,null,null,null,null,null,null,null,null,null,null,1,null,null,null,1,null,null,1,null,null,1,null,null,null,null,null,null,null,null,null,null,null,null,null,null,null,null,null,null,null,null,null,null,null,null,null,null,null,null,null,null,null,null,null,null,null,null,null,null,null,null,null,null,null,null,null,null,null,null,null,null,null,null,null,null,null,null,null,null,null,null,null,null,null,null,null,null,null,null,null,null,null,null,null,null,null,1,null,null,null,1,null,null,null,1,null,null,null,1]
["FAG13N10","Abdeckplatte 250x450mm 1FB/3RE","geschlossen (10 Stück)","ST",1,10,0,228.5,"335"]
["FAG14N","Abdeckplatte 250x600mm 1FB/4RE","geschlossen","ST",1,1,0,37.5,"335",null,null,null,null,null,null,null,null,null,null,null,null,null,null,null,null,null,null,null,null,null,null,null,null,null,null,null,1,null,1,1,null,1,null,null,null,null,null,null,null,null,null,null,null,null,null,null,null,null,null,null,null,null,null,null,null,null,null,null,null,null,null,null,null,null,null,null,null,null,null,null,null,null,null,null,null,null,null,null,null,null,null,null,null,null,null,null,null,null,null,null,null,null,null,null,null,null,null,null,null,null,null,null,null,null,null,null,null,null,null,null,null,null,null,null,null,null,null,null,null,null,1,null,1,1,1,null,1]
["FAG14N10","Abdeckplatte 250x600mm 1FB/4RE","geschlossen (10 Stück)","ST",1,10,0,251,"335"]
["FAG15N","Abdeckplatte 250x750mm 1FB/5RE","geschlossen","ST",1,1,0,47.7,"335",null,null,null,null,null,null,null,null,null,null,null,null,null,null,null,null,null,null,null,null,null,null,null,null,null,null,null,null,null,null,null,null,null,1,null,1,1,1,null,null,null,null,null,null,null,null,null,null,null,null,null,null,null,null,null,null,null,null,null,null,null,null,null,null,null,null,null,null,null,null,null,null,null,null,null,null,null,null,null,null,null,null,null,null,null,null,null,null,null,null,null,null,null,null,null,null,null,null,null,null,null,null,null,null,null,null,null,null,null,null,null,null,null,null,null,null,null,null,null,null,null,null,null,null,null,null,null,null,1,null,1,1,1,1]
["FAG15N10","Abdeckplatte 250x750mm 1FB/5RE","geschlossen (10 Stück)","ST",1,10,0,319,"335"]
["FAG21N","Abdeckplatte 500x150mm 2FB/1RE","geschlossen","ST",1,1,0,26.9,"335",null,null,null,null,null,null,null,null,null,null,null,null,null,null,null,null,null,null,null,null,null,null,null,null,null,null,null,null,null,null,null,null,null,null,null,null,null,null,null,null,null,1,null,1,1,1,null,null,null,null,null,null,null,null,null,null,null,null,null,null,null,null,null,null,null,null,null,null,null,null,null,null,null,null,null,null,null,null,null,null,null,null,null,null,null,null,null,null,null,null,null,null,null,null,null,null,null,null,null,null,null,null,null,null,null,null,null,null,null,null,null,null,null,null,null,null,null,null,null,null,null,null,null,null,null,null,null,null,null,null,null,null,null,null,null,null,null,null,1,null,1,1,1,1]
["FAG21N10","Abdeckplatte 500x150mm 2FB/1RE","geschlossen (10 Stück)","ST",1,10,0,180.5,"335"]
["FAG22N","Abdeckplatte 500x300mm 2FB/2RE","geschlossen","ST",1,1,0,36.799999999999997,"335",null,null,null,null,null,null,null,null,null,null,null,null,null,null,null,null,null,null,null,null,null,null,null,null,null,null,null,null,null,null,null,null,null,null,null,null,null,null,null,null,null,null,null,null,null,null,1,null,null,null,null,null,1,null,1,null,1,null,null,null,null,null,null,null,null,null,null,null,null,null,null,null,null,null,null,null,null,null,null,null,null,null,null,null,null,null,null,null,null,null,null,null,null,null,null,null,null,null,null,null,null,null,null,null,null,null,null,null,null,null,null,null,null,null,null,null,null,null,null,null,null,null,null,null,null,null,null,null,null,null,null,null,null,null,null,null,null,null,null,null,null,null,null,null,null,null,null,null,null,null,1,null,null,1,null,1,1]
["FAG22N10","Abdeckplatte 500x300mm 2FB/2RE","geschlossen (10 Stück)","ST",1,10,0,245.5,"335"]
{"$rows_left_out":478}
{"sheet":"Tabelle1","index":1,"n_rows":492,"n_cols":423,"rows_kept":492,"cut":false,"hidden":true,"merged":[]}
["Artikel-Nr.","MF1110","MF1120","MF1126","MF1160","MF1170","MF1210","MF12130","MF12150","MF1220","MF12230","MF1226","MF12309","MF1260","MF12674","MF12695","MF1270","MF1310","MF13150","MF1320","MF13250","MF1326","MF13312","MF13322","MF1360","MF13674","MF13695","MF1370","MF1410","MF1420","MF1426","MF1460","MF14695","MF1470","MF1510","MF1520","MF1526","MF1560","MF1570","MF15903","MF15950","MF15951","MF2110","MF2120","MF2126","MF2160","MF2170","MF2210","MF22131","MF22151","MF2220","MF22231","MF22251","MF2226","MF22309","MF2260","MF22674","MF2270","MF2310","MF23160","MF2320","MF2326","MF23260","MF23322","MF2360","MF23674","MF2370","MF2410","MF24160","MF2420","MF2426","MF24260","MF2460","MF2470","MF2510","MF2520","MF2526","MF2560","MF2570","MF25903","MT1110","MT1120","MT1126","MT1160","MT1169","MT1170","MT1210","MT12130","MT12150","MT1220","MT12230","MT1226","MT12309","MT12509","MT1260","MT12674","MT1267A","MT1269","MT12695","MT1270","MT12709","MT12774","MT1281","MT1310","MT13150","MT1320","MT13250","MT1326","MT13312","MT13322","MT13512","MT1360","MT13674","MT1369","MT13695","MT1370","MT13703","MT13709","MT13722","MT13774M","MT1380","MT1381","MT1410","MT1420","MT1426","MT1460","MT1469","MT14695","MT1470","MT1510","MT1520","MT1526","MT1560","MT1569","MT1570","MT1581","MT15903","MT15950","MT15951","MT2110","MT2120","MT2126","MT2160","MT2169","MT2170","MT2210","MT22131","MT22151","MT2220","MT22231","MT22251","MT2226","MT22309","MT22509","MT2260","MT22674","MT2269","MT2270","MT22709","MT22774","MT2310","MT23160","MT2320","MT2326","MT23260","MT23322","MT23512","MT23519","MT2360","MT23674","MT2369","MT2370","MT23703","MT23709","MT23722","MT23774M","MT2410","MT24160","MT2420","MT2426","MT24260","MT2460","MT2469","MT2470","MT2510","MT2520","MT2526","MT2560","MT2569","MT2570","MT25903","MFS22603","MFS23605","MFS25903","MFS28905","MFS42603","MFS43605","MFS45903","MFS48905","MFS52603","MFS53605","MFS55903","MFS58905","MFSC12613","MFSC12633","MFSC12643","MFSC13615","MFSC13625","MFSC13635","MFSC13645","MFSC15963","MFSC15983","MFSC17965","MFSC18985","MFSC22613","MFSC22633","MFSC22643","MFSC23615","MFSC23635","MFSC23645","MFSC25963","MFSC25983","MFSC27965","MFSC28985","MFSC32613","MFSC32633","MFSC32643","MFSC33615","MFSC33635","MFSC33645","MFSC35963","MFSC35983","MFSC37965","MFSC38985","MFSC42613","MFSC42633","MFSC42643","MFSC43615","MFSC43635","MFSC43645","MFSC45963","MFSC45983","MFSC47965","MFSC48985","MFSC52613","MFSC52633","MFSC52643","MFSC53615","MFSC53635","MFSC53645","MFSC55963","MFSC55983","MFSC57965","MFSC58985","MTS12505","MTS22505","MTS22603","MTS22703","MTS23605","MTS23705","MTS25903","MTS28905","MTS32505","MTS42505","MTS42603","MTS42703","MTS43605","MTS43705","MTS45903","MTS48905","MTS52505","MTS52603","MTS52703","MTS53605","MTS53705","MTS55903","MTS58905","MTSC12515","MTSC12535","MTSC12613","MTSC12633","MTSC12643","MTSC12733","MTSC12743","MTSC12763","MTSC13615","MTSC13635","MTSC13645","MTSC13735","MTSC13745","MTSC13765","MTSC15963","MTSC15983","MTSC17965","MTSC18985","MTSC22515","MTSC22535","MTSC22613","MTSC22633","MTSC22643","MTSC22653","MTSC22733","MTSC22743","MTSC22763","MTSC23615","MTSC23635","MTSC23645","MTSC23735","MTSC23745","MTSC23765","MTSC25963","MTSC25983","MTSC27965","MTSC28985","MTSC32515","MTSC32535","MTSC32613","MTSC32633","MTSC32643","MTSC32733","MTSC32743","MTSC32763","MTSC33615","MTSC33635","MTSC33645","MTSC33735","MTSC33745","MTSC33765","MTSC35963","MTSC35983","MTSC35993","MTSC37965","MTSC38985","MTSC42515","MTSC42535","MTSC42613","MTSC42633","MTSC42643","MTSC42733","MTSC42743","MTSC42753","MTSC42763","MTSC43615","MTSC43635","MTSC43645","MTSC43735","MTSC43745","MTSC43765","MTSC45963","MTSC45973","MTSC45983","MTSC47965","MTSC48985","MTSC52515","MTSC52535","MTSC52613","MTSC52633","MTSC52643","MTSC52733","MTSC52743","MTSC52763","MTSC53615","MTSC53635","MTSC53645","MTSC53735","MTSC53745","MTSC53765","MTSC55963","MTSC55983","MTSC57965","MTSC58985","MXS21201","MXS21301","MXS21401","MXS41301","MXS41401","MXS51301","MXS51401","MXSC11211","MXSC11231","MXSC11311","MXSC11331","MXSC11341","MXSC11361","MXSC11411","MXSC11431","MXSC11441","MXSC11461","MXSC21211","MXSC21231","MXSC21311","MXSC21331","MXSC21341","MXSC21361","MXSC21411","MXSC21431","MXSC21441","MXSC21461","MXSC31311","MXSC31331","MXSC31341","MXSC31351","MXSC31361","MXSC31411","MXSC31431","MXSC31441","MXSC31461","MXSC41311","MXSC41331","MXSC41341","MXSC41361","MXSC41411","MXSC41431","MXSC41441","MXSC41461","MXSC51311","MXSC51331","MXSC51341","MXSC51361","MXSC51411","MXSC51431","MXSC51441","MXSC51461"]
["FAG11N",1,null,1,1,1,null,null,null,null,null,null,null,null,null,null,null,null,null,null,null,null,null,null,null,null,null,null,null,null,null,null,null,null,null,null,null,null,null,null,null,null,null,null,null,null,null,null,null,null,null,null,null,null,null,null,null,null,null,null,null,null,null,null,null,null,null,null,null,null,null,null,null,null,null,null,null,null,null,null,1,null,1,1,null,1]
["FAG11N10"]
["FAG12N",null,null,null,null,null,1,null,null,null,null,1,null,1,null,null,1,null,null,null,null,null,null,null,null,null,null,null,null,null,null,null,null,null,null,null,null,null,null,null,null,null,null,null,null,null,null,null,null,null,null,null,null,null,null,null,null,null,null,null,null,null,null,null,null,null,null,null,null,null,null,null,null,null,null,null,null,null,null,null,null,null,null,null,null,null,1,null,null,null,null,1,null,null,1,null,null,1,null,1]
["FAG12N10"]
["FAG13N",null,null,null,null,null,null,null,null,null,null,null,null,null,null,null,null,1,null,null,null,1,null,null,1,null,null,1,null,null,null,null,null,null,null,null,null,null,null,null,null,null,null,null,null,null,null,null,null,null,null,null,null,null,null,null,null,null,null,null,null,null,null,null,null,null,null,null,null,null,null,null,null,null,null,null,null,null,null,null,null,null,null,null,null,null,null,null,null,null,null,null,null,null,null,null,null,null,null,null,null,null,null,1,null,null,null,1,null,null,null,1,null,null,null,1]
["FAG13N10"]
["FAG14N",null,null,null,null,null,null,null,null,null,null,null,null,null,null,null,null,null,null,null,null,null,null,null,null,null,null,null,1,null,1,1,null,1,null,null,null,null,null,null,null,null,null,null,null,null,null,null,null,null,null,null,null,null,null,null,null,null,null,null,null,null,null,null,null,null,null,null,null,null,null,null,null,null,null,null,null,null,null,null,null,null,null,null,null,null,null,null,null,null,null,null,null,null,null,null,null,null,null,null,null,null,null,null,null,null,null,null,null,null,null,null,null,null,null,null,null,null,null,null,null,null,1,null,1,1,1,null,1]
["FAG14N10"]
["FAG15N",null,null,null,null,null,null,null,null,null,null,null,null,null,null,null,null,null,null,null,null,null,null,null,null,null,null,null,null,null,null,null,null,null,1,null,1,1,1,null,null,null,null,null,null,null,null,null,null,null,null,null,null,null,null,null,null,null,null,null,null,null,null,null,null,null,null,null,null,null,null,null,null,null,null,null,null,null,null,null,null,null,null,null,null,null,null,null,null,null,null,null,null,null,null,null,null,null,null,null,null,null,null,null,null,null,null,null,null,null,null,null,null,null,null,null,null,null,null,null,null,null,null,null,null,null,null,null,null,1,null,1,1,1,1]
["FAG15N10"]
["FAG21N",null,null,null,null,null,null,null,null,null,null,null,null,null,null,null,null,null,null,null,null,null,null,null,null,null,null,null,null,null,null,null,null,null,null,null,null,null,null,null,null,null,1,null,1,1,1,null,null,null,null,null,null,null,null,null,null,null,null,null,null,null,null,null,null,null,null,null,null,null,null,null,null,null,null,null,null,null,null,null,null,null,null,null,null,null,null,null,null,null,null,null,null,null,null,null,null,null,null,null,null,null,null,null,null,null,null,null,null,null,null,null,null,null,null,null,null,null,null,null,null,null,null,null,null,null,null,null,null,null,null,null,null,null,null,null,null,null,null,1,null,1,1,1,1]
["FAG21N10"]
["FAG22N",null,null,null,null,null,null,null,null,null,null,null,null,null,null,null,null,null,null,null,null,null,null,null,null,null,null,null,null,null,null,null,null,null,null,null,null,null,null,null,null,null,null,null,null,null,null,1,null,null,null,null,null,1,null,1,null,1,null,null,null,null,null,null,null,null,null,null,null,null,null,null,null,null,null,null,null,null,null,null,null,null,null,null,null,null,null,null,null,null,null,null,null,null,null,null,null,null,null,null,null,null,null,null,null,null,null,null,null,null,null,null,null,null,null,null,null,null,null,null,null,null,null,null,null,null,null,null,null,null,null,null,null,null,null,null,null,null,null,null,null,null,null,null,null,1,null,null,null,null,null,1,null,null,1,null,1,1]
["FAG22N10"]
{"$rows_left_out":478}
{"sheet":"Auswahlhilfe","index":2,"n_rows":501,"n_cols":7,"rows_kept":501,"cut":false,"hidden":false,"merged":[]}
["Auswahlhilfe für Einzelkomponenten für die Verteilertechnik"]
["Module, die sich nicht aus dem Einzelteile-Baukasten "]
["kombinieren lassen, werden nicht dargestellt."]
[]
["Eingabe der Artikelnummer und Stückzahl in die gelben Felder."]
[]
["MT12674",null,null,null,"Anzahl Module",1]
[]
["Aritkelnummer","Anzahl",null,"Art.Nr. Mehrpack","% Inhalt vom Einzelartikel","Stückzahl von Einzelartikel","Benötigte Anzahl Mehrpack"]
["Artikelnummer","Anzahl",null,"Spalte1","Spalte2","Spalte3","Spalte4"]
["FAG11N",{"$f":"($F$7*(INDEX(Tabelle1!$A$1:$PG$492,MATCH($A11,Tabelle1!$A$1:$A$492,0),MATCH($A$7,Tabelle1!$A$1:$PG$1,0))))","v":0},null,"FAG11N10",0.1,10,{"$f":"Tabelle2[[#This Row],[Anzahl]]/Tabelle3[[#This Row],[Spalte3]]","v":0}]
["FAG11N10",{"$f":"($F$7*(INDEX(Tabelle1!$A$1:$PG$492,MATCH($A12,Tabelle1!$A$1:$A$492,0),MATCH($A$7,Tabelle1!$A$1:$PG$1,0))))","v":0},null,null,null,null,{"$f":"Tabelle2[[#This Row],[Anzahl]]/Tabelle3[[#This Row],[Spalte3]]","v":{"$error":"#DIV/0!"}}]
["FAG12N",{"$f":"($F$7*(INDEX(Tabelle1!$A$1:$PG$492,MATCH($A13,Tabelle1!$A$1:$A$492,0),MATCH($A$7,Tabelle1!$A$1:$PG$1,0))))","v":0},null,"FAG12N10",0.1,10,{"$f":"Tabelle2[[#This Row],[Anzahl]]/Tabelle3[[#This Row],[Spalte3]]","v":0}]
["FAG12N10",{"$f":"($F$7*(INDEX(Tabelle1!$A$1:$PG$492,MATCH($A14,Tabelle1!$A$1:$A$492,0),MATCH($A$7,Tabelle1!$A$1:$PG$1,0))))","v":0},null,null,null,null,{"$f":"Tabelle2[[#This Row],[Anzahl]]/Tabelle3[[#This Row],[Spalte3]]","v":{"$error":"#DIV/0!"}}]
["FAG13N",{"$f":"($F$7*(INDEX(Tabelle1!$A$1:$PG$492,MATCH($A15,Tabelle1!$A$1:$A$492,0),MATCH($A$7,Tabelle1!$A$1:$PG$1,0))))","v":0},null,"FAG13N10",0.1,10,{"$f":"Tabelle2[[#This Row],[Anzahl]]/Tabelle3[[#This Row],[Spalte3]]","v":0}]
{"$rows_left_out":486}